Target
Tryptophan 5-hydroxylase 2
Ligand
BDBM357736
Substrate
Meas. Tech.
ChEMBL_2228294 (CHEMBL5141807)
IC50
20±n/a nM
Citation
 Specker, EMatthes, SWesolowski, RSchütz, AGrohmann, MAlenina, NPleimes, DMallow, KNeuenschwander, MGogolin, AWeise, MPfeifer, JZiebart, NHeinemann, Uvon Kries, JPNazaré, MBader, M Structure-Based Design of Xanthine-Benzimidazole Derivatives as Novel and Potent Tryptophan Hydroxylase Inhibitors. J Med Chem 65:11126-11149 (2022) Target
Name:
Tryptophan 5-hydroxylase 2
Synonyms:
NTPH TPH2_HUMAN
Type:
PROTEIN
Mol. Mass.:
56055.12
Organism:
Homo sapiens (Human)
Description:
ChEMBL_487490
Residue:
490
  
Inhibitor
Name:
BDBM357736
Synonyms:
MW-01-157/(I-207) | US10214530, Example 25
Type:
Small organic molecule
Emp. Form.:
C23H22N6O2
Mol. Mass.:
414.4598
SMILES:
CCCn1c2nc(Cc3nc4ccccc4[nH]3)n(Cc3ccccc3)c2c(=O)[nH]c1=O
: