Target
Tryptophan 5-hydroxylase 2
Ligand
BDBM357735
Substrate
Meas. Tech.
ChEMBL_2228294 (CHEMBL5141807)
IC50
14±n/a nM
Citation
 Specker, EMatthes, SWesolowski, RSchütz, AGrohmann, MAlenina, NPleimes, DMallow, KNeuenschwander, MGogolin, AWeise, MPfeifer, JZiebart, NHeinemann, Uvon Kries, JPNazaré, MBader, M Structure-Based Design of Xanthine-Benzimidazole Derivatives as Novel and Potent Tryptophan Hydroxylase Inhibitors. J Med Chem 65:11126-11149 (2022) Target
Name:
Tryptophan 5-hydroxylase 2
Synonyms:
NTPH TPH2_HUMAN
Type:
PROTEIN
Mol. Mass.:
56055.12
Organism:
Homo sapiens (Human)
Description:
ChEMBL_487490
Residue:
490
  
Inhibitor
Name:
BDBM357735
Synonyms:
KM-05-193/(I-209) | US10214530, Example 27
Type:
Small organic molecule
Emp. Form.:
C24H22N6O4
Mol. Mass.:
458.4693
SMILES:
CCCn1c2nc(Cc3nc4cc5OCOc5cc4[nH]3)n(Cc3ccccc3)c2c(=O)[nH]c1=O
: