Target
Tryptophan 5-hydroxylase 2
Ligand
BDBM50598895
Substrate
Meas. Tech.
ChEMBL_2228294 (CHEMBL5141807)
IC50
20±n/a nM
Citation
 Specker, EMatthes, SWesolowski, RSchütz, AGrohmann, MAlenina, NPleimes, DMallow, KNeuenschwander, MGogolin, AWeise, MPfeifer, JZiebart, NHeinemann, Uvon Kries, JPNazaré, MBader, M Structure-Based Design of Xanthine-Benzimidazole Derivatives as Novel and Potent Tryptophan Hydroxylase Inhibitors. J Med Chem 65:11126-11149 (2022) Target
Name:
Tryptophan 5-hydroxylase 2
Synonyms:
NTPH TPH2_HUMAN
Type:
PROTEIN
Mol. Mass.:
56055.12
Organism:
Homo sapiens (Human)
Description:
ChEMBL_487490
Residue:
490
  
Inhibitor
Name:
BDBM50598895
Synonyms:
CHEMBL5172829
Type:
Small organic molecule
Emp. Form.:
C24H24N6O3
Mol. Mass.:
444.4858
SMILES:
CCOc1ccc2[nH]c(Cc3nc4n(CC)c(=O)[nH]c(=O)c4n3Cc3ccccc3)nc2c1
: