Target
Transcription activator BRG1
Ligand
BDBM50598934
Substrate
Meas. Tech.
ChEMBL_2228702 (CHEMBL5142215)
Kd
510±n/a nM
Citation
 Taylor, AMBailey, CBelmont, LDCampbell, RCantone, NCôté, ACrawford, TDCummings, RDeMent, KDuplessis, MFlynn, MGood, ACHuang, HRJoshi, SLeblanc, YMurray, JNasveschuk, CGNeiss, APoy, FRomero, FASandy, PTang, YTsui, VZawadzke, LSims, RJAudia, JEBellon, SFMagnuson, SRAlbrecht, BKCochran, AG GNE-064: A Potent, Selective, and Orally Bioavailable Chemical Probe for the Bromodomains of SMARCA2 and SMARCA4 and the Fifth Bromodomain of PBRM1. J Med Chem 65:11177-11186 (2022) Target
Name:
Transcription activator BRG1
Synonyms:
ATP-dependent helicase SMARCA4 BRG1 Mitotic growth and transcription activator Protein brahma homolog 1 SMCA4_HUMAN SNF2B SWI/SNF-related matrix-associated actin-dependent regulator of chromatin subfamily A member 4
Type:
PROTEIN
Mol. Mass.:
184666.66
Organism:
Homo sapiens (Human)
Description:
ChEMBL_107968
Residue:
1647
  
Inhibitor
Name:
BDBM50598934
Synonyms:
CHEMBL5183240
Type:
Small organic molecule
Emp. Form.:
C16H12N4
Mol. Mass.:
260.2933
SMILES:
Nc1nnc2c3ccccc3[nH]c2c1-c1ccccc1
: