Target
Transcription activator BRG1
Ligand
BDBM394583
Substrate
Meas. Tech.
ChEMBL_2228702 (CHEMBL5142215)
Kd
86±n/a nM
Citation
 Taylor, AMBailey, CBelmont, LDCampbell, RCantone, NCôté, ACrawford, TDCummings, RDeMent, KDuplessis, MFlynn, MGood, ACHuang, HRJoshi, SLeblanc, YMurray, JNasveschuk, CGNeiss, APoy, FRomero, FASandy, PTang, YTsui, VZawadzke, LSims, RJAudia, JEBellon, SFMagnuson, SRAlbrecht, BKCochran, AG GNE-064: A Potent, Selective, and Orally Bioavailable Chemical Probe for the Bromodomains of SMARCA2 and SMARCA4 and the Fifth Bromodomain of PBRM1. J Med Chem 65:11177-11186 (2022) Target
Name:
Transcription activator BRG1
Synonyms:
ATP-dependent helicase SMARCA4 BRG1 Mitotic growth and transcription activator Protein brahma homolog 1 SMCA4_HUMAN SNF2B SWI/SNF-related matrix-associated actin-dependent regulator of chromatin subfamily A member 4
Type:
PROTEIN
Mol. Mass.:
184666.66
Organism:
Homo sapiens (Human)
Description:
ChEMBL_107968
Residue:
1647
  
Inhibitor
Name:
BDBM394583
Synonyms:
2-(6-amino-5-phenylpyridazin-3-yl)phenol | US10308614, Example 186
Type:
Small organic molecule
Emp. Form.:
C16H13N3O
Mol. Mass.:
263.2939
SMILES:
Nc1nnc(cc1-c1ccccc1)-c1ccccc1O
: