Target
Integrase
Ligand
BDBM50176113
Substrate
Meas. Tech.
ChEMBL_321433 (CHEMBL880241)
IC50
2±n/a nM
Citation
 Barreca, MLFerro, SRao, ADe Luca, LZappalà, MMonforte, AMDebyser, ZWitvrouw, MChimirri, A Pharmacophore-based design of HIV-1 integrase strand-transfer inhibitors. J Med Chem 48:7084-8 (2005)  
Target
Name:
Integrase
Synonyms:
Human immunodeficiency virus type 1 integrase
Type:
PROTEIN
Mol. Mass.:
32231.48
Organism:
Human immunodeficiency virus 1
Description:
ChEMBL_90865
Residue:
288
  
Inhibitor
Name:
BDBM50176113
Synonyms:
(Z)-4-[1-(4-Fluoro-benzyl)-1H-indol-3-yl]-2-hydroxy-4-oxo-but-2-enoic acid | CHEMBL198001
Type:
Small organic molecule
Emp. Form.:
C19H14FNO4
Mol. Mass.:
339.3172
SMILES:
OC(=O)C(=O)CC(=O)c1cn(Cc2ccc(F)cc2)c2ccccc12
: