Target
Integrase
Ligand
BDBM23400
Substrate
Meas. Tech.
ChEMBL_321311 (CHEMBL881407)
IC50
10±n/a nM
Citation
 Barreca, MLFerro, SRao, ADe Luca, LZappalà, MMonforte, AMDebyser, ZWitvrouw, MChimirri, A Pharmacophore-based design of HIV-1 integrase strand-transfer inhibitors. J Med Chem 48:7084-8 (2005)  
Target
Name:
Integrase
Synonyms:
Human immunodeficiency virus type 1 integrase
Type:
PROTEIN
Mol. Mass.:
32231.48
Organism:
Human immunodeficiency virus 1
Description:
ChEMBL_90865
Residue:
288
  
Inhibitor
Name:
BDBM23400
Synonyms:
(2Z)-4-(3-benzylphenyl)-2-hydroxy-4-oxobut-2-enoic acid CHEMBL19464 | GS-016405
Type:
Small organic molecule
Emp. Form.:
C17H14O4
Mol. Mass.:
282.2907
SMILES:
OC(=O)C(=O)CC(=O)c1cccc(Cc2ccccc2)c1
: