Target
5-hydroxytryptamine receptor 2A
Ligand
BDBM50176267
Substrate
Meas. Tech.
ChEMBL_331164 (CHEMBL854091)
EC50
222±n/a nM
Citation
 Adams, DRBentley, JMBenwell, KRBickerdike, MJBodkin, CDCliffe, IADourish, CTGeorge, ARKennett, GAKnight, ARMalcolm, CSMansell, HLMisra, AQuirk, KRoffey, JRVickers, SP Pyrrolo(iso)quinoline derivatives as 5-HT(2C) receptor agonists. Bioorg Med Chem Lett 16:677-80 (2005)  
Target
Name:
5-hydroxytryptamine receptor 2A
Synonyms:
5-HT-2 5-HT2A 5-hydroxytryptamine receptor 2A (5HT-2A) 5HT2A_HUMAN HTR2A | Serotonin receptor 2A
Type:
undefined
Mol. Mass.:
52607.65
Organism:
Homo sapiens (Human)
Description:
P28223
Residue:
471
  
Inhibitor
Name:
BDBM50176267
Synonyms:
(S)-N-(naphthalen-2-ylmethyl)-1-(1H-pyrrolo[2,3-f]quinolin-1-yl)propan-2-amine | CHEMBL202616
Type:
Small organic molecule
Emp. Form.:
C25H23N3
Mol. Mass.:
365.4702
SMILES:
C[C@@H](Cn1ccc2ccc3ncccc3c12)NCc1ccc2ccccc2c1
: