Target
5-hydroxytryptamine receptor 2A
Ligand
BDBM50176273
Substrate
Meas. Tech.
ChEMBL_331167 (CHEMBL854094)
Ki
1041±n/a nM
Citation
 Adams, DRBentley, JMBenwell, KRBickerdike, MJBodkin, CDCliffe, IADourish, CTGeorge, ARKennett, GAKnight, ARMalcolm, CSMansell, HLMisra, AQuirk, KRoffey, JRVickers, SP Pyrrolo(iso)quinoline derivatives as 5-HT(2C) receptor agonists. Bioorg Med Chem Lett 16:677-80 (2005)  
Target
Name:
5-hydroxytryptamine receptor 2A
Synonyms:
5-HT-2 5-HT2A 5-hydroxytryptamine receptor 2A (5HT-2A) 5HT2A_HUMAN HTR2A | Serotonin receptor 2A
Type:
undefined
Mol. Mass.:
52607.65
Organism:
Homo sapiens (Human)
Description:
P28223
Residue:
471
  
Inhibitor
Name:
BDBM50176273
Synonyms:
(S)-1-(1H-pyrrolo[2,3-f]isoquinolin-1-yl)propan-2-amine | CHEMBL202656
Type:
Small organic molecule
Emp. Form.:
C14H15N3
Mol. Mass.:
225.289
SMILES:
C[C@H](N)Cn1ccc2ccc3cnccc3c12
: