Target
5-hydroxytryptamine receptor 2B
Ligand
BDBM50176264
Substrate
Meas. Tech.
ChEMBL_331168 (CHEMBL854095)
Ki
115±n/a nM
Citation
 Adams, DRBentley, JMBenwell, KRBickerdike, MJBodkin, CDCliffe, IADourish, CTGeorge, ARKennett, GAKnight, ARMalcolm, CSMansell, HLMisra, AQuirk, KRoffey, JRVickers, SP Pyrrolo(iso)quinoline derivatives as 5-HT(2C) receptor agonists. Bioorg Med Chem Lett 16:677-80 (2005)  
Target
Name:
5-hydroxytryptamine receptor 2B
Synonyms:
5-HT-2B 5-hydroxytryptamine (serotonin) receptor 2B [Homo sapiens] 5-hydroxytryptamine receptor 2C (5HT2C) HTR2B Serotonin 2b (5-HT2b) receptor | Serotonin Receptor 2B
Type:
G Protein-Coupled Receptor (GPCR)
Mol. Mass.:
54312.47
Organism:
Homo sapiens (Human)
Description:
Receptor binding assays were performed using human clone stably expressed in CHO cells.
Residue:
481
  
Inhibitor
Name:
BDBM50176264
Synonyms:
(S)-1-(1H-pyrrolo[3,2-h]quinolin-1-yl)propan-2-amine | CHEMBL201062
Type:
Small organic molecule
Emp. Form.:
C14H15N3
Mol. Mass.:
225.289
SMILES:
C[C@H](N)Cn1ccc2ccc3cccnc3c12
: