Target
5-hydroxytryptamine receptor 2A
Ligand
BDBM50176268
Substrate
Meas. Tech.
ChEMBL_331167 (CHEMBL854094)
Ki
1681±n/a nM
Citation
 Adams, DRBentley, JMBenwell, KRBickerdike, MJBodkin, CDCliffe, IADourish, CTGeorge, ARKennett, GAKnight, ARMalcolm, CSMansell, HLMisra, AQuirk, KRoffey, JRVickers, SP Pyrrolo(iso)quinoline derivatives as 5-HT(2C) receptor agonists. Bioorg Med Chem Lett 16:677-80 (2005)  
Target
Name:
5-hydroxytryptamine receptor 2A
Synonyms:
5-HT-2 5-HT2A 5-hydroxytryptamine receptor 2A (5HT-2A) 5HT2A_HUMAN HTR2A | Serotonin receptor 2A
Type:
undefined
Mol. Mass.:
52607.65
Organism:
Homo sapiens (Human)
Description:
P28223
Residue:
471
  
Inhibitor
Name:
BDBM50176268
Synonyms:
(2-methyl-benzyl)-((S)-1-methyl-2-pyrrolo[2,3-f]quinolin-1-yl-ethyl)-amine | CHEMBL379223
Type:
Small organic molecule
Emp. Form.:
C22H23N3
Mol. Mass.:
329.4381
SMILES:
C[C@@H](Cn1ccc2ccc3ncccc3c12)NCc1ccccc1C
: