Target
5-hydroxytryptamine receptor 2B
Ligand
BDBM50176266
Substrate
Meas. Tech.
ChEMBL_331168 (CHEMBL854095)
Ki
138±n/a nM
Citation
 Adams, DRBentley, JMBenwell, KRBickerdike, MJBodkin, CDCliffe, IADourish, CTGeorge, ARKennett, GAKnight, ARMalcolm, CSMansell, HLMisra, AQuirk, KRoffey, JRVickers, SP Pyrrolo(iso)quinoline derivatives as 5-HT(2C) receptor agonists. Bioorg Med Chem Lett 16:677-80 (2005)  
Target
Name:
5-hydroxytryptamine receptor 2B
Synonyms:
5-HT-2B 5-hydroxytryptamine (serotonin) receptor 2B [Homo sapiens] 5-hydroxytryptamine receptor 2C (5HT2C) HTR2B Serotonin 2b (5-HT2b) receptor | Serotonin Receptor 2B
Type:
G Protein-Coupled Receptor (GPCR)
Mol. Mass.:
54312.47
Organism:
Homo sapiens (Human)
Description:
Receptor binding assays were performed using human clone stably expressed in CHO cells.
Residue:
481
  
Inhibitor
Name:
BDBM50176266
Synonyms:
(S)-N-(benzo[d][1,3]dioxol-5-ylmethyl)-1-(1H-pyrrolo[2,3-f]quinolin-1-yl)propan-2-amine | CHEMBL202458
Type:
Small organic molecule
Emp. Form.:
C22H21N3O2
Mol. Mass.:
359.421
SMILES:
C[C@@H](Cn1ccc2ccc3ncccc3c12)NCc1ccc2OCOc2c1
: