Target
Tyrosine-protein kinase Tec
Ligand
BDBM50176316
Substrate
Meas. Tech.
ChEMBL_327882 (CHEMBL864602)
Kd
292000±n/a nM
Citation
 Inglis, SRJones, RKBooker, GWPyke, SM Synthesis of N-benzylated-2-aminoquinolines as ligands for the Tec SH3 domain. Bioorg Med Chem Lett 16:387-90 (2005)  
Target
Name:
Tyrosine-protein kinase Tec
Synonyms:
PSCTK4 TEC_HUMAN | Tyrosine-protein kinase TEC (TEC)
Type:
Protein
Mol. Mass.:
73597.00
Organism:
Homo sapiens (Human)
Description:
Residue:
631
  
Inhibitor
Name:
BDBM50176316
Synonyms:
4-((quinolin-2-ylamino)methyl)phenol | CHEMBL202984
Type:
Small organic molecule
Emp. Form.:
C16H14N2O
Mol. Mass.:
250.2952
SMILES:
Oc1ccc(CNc2ccc3ccccc3n2)cc1
: