Target
Tyrosine-protein kinase Tec
Ligand
BDBM50176315
Substrate
Meas. Tech.
ChEMBL_327882 (CHEMBL864602)
Kd
285000±n/a nM
Citation
 Inglis, SRJones, RKBooker, GWPyke, SM Synthesis of N-benzylated-2-aminoquinolines as ligands for the Tec SH3 domain. Bioorg Med Chem Lett 16:387-90 (2005)  
Target
Name:
Tyrosine-protein kinase Tec
Synonyms:
PSCTK4 TEC_HUMAN | Tyrosine-protein kinase TEC (TEC)
Type:
Protein
Mol. Mass.:
73597.00
Organism:
Homo sapiens (Human)
Description:
Residue:
631
  
Inhibitor
Name:
BDBM50176315
Synonyms:
CHEMBL199638 | N-((1H-pyrrol-2-yl)methyl)quinolin-2-amine
Type:
Small organic molecule
Emp. Form.:
C14H13N3
Mol. Mass.:
223.2731
SMILES:
C(Nc1ccc2ccccc2n1)c1ccc[nH]1
: