Target
Lysophosphatidic acid receptor 1
Ligand
BDBM50176391
Substrate
Meas. Tech.
ChEMBL_333862 (CHEMBL864091)
IC50
692±n/a nM
Citation
 Durgam, GGTsukahara, RMakarova, NWalker, MDFujiwara, YPigg, KRBaker, DLSardar, VMParrill, ALTigyi, GMiller, DD Synthesis and pharmacological evaluation of second-generation phosphatidic acid derivatives as lysophosphatidic acid receptor ligands. Bioorg Med Chem Lett 16:633-40 (2005)  
Target
Name:
Lysophosphatidic acid receptor 1
Synonyms:
EDG2 LPA-1 LPAR1 Lysophosphatidic acid receptor 1 (LPA1) | Lysophosphatidic acid receptor Edg-2
Type:
Enzyme
Mol. Mass.:
41120.55
Organism:
Homo sapiens (Human)
Description:
Q92633
Residue:
364
  
Inhibitor
Name:
BDBM50176391
Synonyms:
CHEMBL202185 | octanoic acid (R)-2-octanoyloxy-3-phosphonooxy-propyl ester
Type:
Small organic molecule
Emp. Form.:
C19H37O8P
Mol. Mass.:
424.466
SMILES:
CCCCCCCC(=O)OC[C@H](COP(O)(O)=O)OC(=O)CCCCCCC
: