Target
5-hydroxytryptamine receptor 2B
Ligand
BDBM50060417
Substrate
Meas. Tech.
ChEMBL_2229479 (CHEMBL5142992)
Ki
20±n/a nM
Citation
 Namballa, HKMadapa, SSigalapalli, DKHarding, WW Semisynthetic Transformations on (+)-Boldine Reveal a 5-HT J Nat Prod 85:2149-2158 (2022) Target
Name:
5-hydroxytryptamine receptor 2B
Synonyms:
5-HT-2B 5-hydroxytryptamine (serotonin) receptor 2B [Homo sapiens] 5-hydroxytryptamine receptor 2C (5HT2C) HTR2B Serotonin 2b (5-HT2b) receptor | Serotonin Receptor 2B
Type:
G Protein-Coupled Receptor (GPCR)
Mol. Mass.:
54312.47
Organism:
Homo sapiens (Human)
Description:
Receptor binding assays were performed using human clone stably expressed in CHO cells.
Residue:
481
  
Inhibitor
Name:
BDBM50060417
Synonyms:
5-Methyl-3,5-dihydro-2H-pyrrolo[2,3-f]indole-1-carboxylic acid pyridin-3-ylamide SB 206553 | SB-206553
Type:
Small organic molecule
Emp. Form.:
C17H16N4O
Mol. Mass.:
292.3351
SMILES:
Cn1ccc2cc3N(CCc3cc12)C(=O)Nc1cccnc1
: