Target
Metabotropic glutamate receptor 5
Ligand
BDBM50177093
Substrate
Meas. Tech.
ChEMBL_430992 (CHEMBL916420)
IC50
344±n/a nM
Citation
 Zheng, GZBhatia, PDaanen, JKolasa, TPatel, MLatshaw, SEl Kouhen, OFChang, RUchic, MEMiller, LNakane, MLehto, SGHonore, MPMoreland, RBBrioni, JDStewart, AO Structure-activity relationship of triazafluorenone derivatives as potent and selective mGluR1 antagonists. J Med Chem 48:7374-88 (2005)  
Target
Name:
Metabotropic glutamate receptor 5
Synonyms:
GPRC1E GRM5_HUMAN metabotropic glutamate 5 | metabotropic glutamate 5a
Type:
Enzyme
Mol. Mass.:
132484.72
Organism:
Homo sapiens (Human)
Description:
Residue:
1212
  
Inhibitor
Name:
BDBM50177093
Synonyms:
9-Dimethylamino-3-(4-ethyl-phenyl)-2-methyl-3H-pyrido[3',2':4,5]thieno[3,2-d]pyrimidin-4-one CHEMBL224673
Type:
Small organic molecule
Emp. Form.:
C20H20N4OS
Mol. Mass.:
364.464
SMILES:
CCc1ccc(cc1)-n1c(C)nc2c(sc3nccc(N(C)C)c23)c1=O
: