Target
Substance-P receptor
Ligand
BDBM50177374
Substrate
Meas. Tech.
ChEMBL_334652 (CHEMBL854118)
Ki
3.6±n/a nM
Citation
 Shue, HJChen, XSchwerdt, JHPaliwal, SBlythin, DJLin, LGu, DWang, CReichard, GAWang, HPiwinski, JJDuffy, RALachowicz, JECoffin, VLNomeir, AAMorgan, CAVarty, GBShih, NY Cyclic urea derivatives as potent NK1 selective antagonists. Part II: Effects of fluoro and benzylic methyl substitutions. Bioorg Med Chem Lett 16:1065-9 (2006)  
Target
Name:
Substance-P receptor
Synonyms:
NK-1 receptor NK1 Receptor NK1R_HUMAN Neurokinin-1 (NK-1) SPR TACR1 Tachykinin receptor 1 (NK1) | tachykinin
Type:
G Protein-Coupled Receptor (GPCR)
Mol. Mass.:
46254.43
Organism:
Homo sapiens (Human)
Description:
P25103
Residue:
407
  
Inhibitor
Name:
BDBM50177374
Synonyms:
(R)-4-(((R)-1-(3,5-bis(trifluoromethyl)phenyl)ethoxy)methyl)-4-(4-fluorophenyl)-1-methylimidazolidin-2-one | CHEMBL382771
Type:
Small organic molecule
Emp. Form.:
C21H19F7N2O2
Mol. Mass.:
464.3766
SMILES:
C[C@@H](OC[C@]1(CN(C)C(=O)N1)c1ccc(F)cc1)c1cc(cc(c1)C(F)(F)F)C(F)(F)F
: