Target
Succinate-semialdehyde dehydrogenase, mitochondrial
Ligand
BDBM50177412
Substrate
Meas. Tech.
ChEMBL_332432 (CHEMBL867028)
IC50
>1000000±n/a nM
Citation
 Tao, YHYuan, ZTang, XQXu, HBYang, XL Inhibition of GABA shunt enzymes' activity by 4-hydroxybenzaldehyde derivatives. Bioorg Med Chem Lett 16:592-5 (2005)  
Target
Name:
Succinate-semialdehyde dehydrogenase, mitochondrial
Synonyms:
ALDH5A1 NAD(+)-dependent succinic semialdehyde dehydrogenase SSDH_HUMAN Succinate-semialdehyde dehydrogenase, mitochondrial
Type:
PROTEIN
Mol. Mass.:
57224.70
Organism:
Homo sapiens (Human)
Description:
ChEMBL_1459249
Residue:
535
  
Inhibitor
Name:
BDBM50177412
Synonyms:
4-(aminomethyl)phenol CHEMBL202519
Type:
Small organic molecule
Emp. Form.:
C7H9NO
Mol. Mass.:
123.1525
SMILES:
NCc1ccc(O)cc1
: