Target
Glutamate receptor ionotropic, NMDA 2A
Ligand
BDBM50599749
Substrate
Meas. Tech.
ChEMBL_2231626 (CHEMBL5145398)
EC50
11±n/a nM
Citation
 Sakurai, FYukawa, TKina, AMurakami, MTakami, KMorimoto, SSeto, MKamata, MYamashita, TNakashima, KNarita, NBettini, EUgolini, ACorsi, MHasui, T Discovery of Pyrazolo[1,5-a]pyrazin-4-ones as Potent and Brain Penetrant GluN2A-Selective Positive Allosteric Modulators Reducing AMPA Receptor Binding Activity. Bioorg Med Chem 56:0 (2022) Target
Name:
Glutamate receptor ionotropic, NMDA 2A
Synonyms:
GRIN2A Glutamate [NMDA] receptor Glutamate [NMDA] receptor subunit epsilon-1 NMDA receptor subtype 2A protein (NR2A) NMDE1_HUMAN hNR2A
Type:
Mol. Mass.:
165293.76
Organism:
Homo sapiens (Human)
Description:
Residue:
1464
  
Inhibitor
Name:
BDBM50599749
Synonyms:
CHEMBL5171984
Type:
Small organic molecule
Emp. Form.:
C16H8ClF6N5OS
Mol. Mass.:
467.776
SMILES:
FC(F)(F)c1cc(Cl)n(Cc2cc(=O)n3c([C@@H]4C[C@@H]4C#N)c(sc3n2)C(F)(F)F)n1
: