Target
Poly [ADP-ribose] polymerase 1
Ligand
BDBM50177460
Substrate
Meas. Tech.
ChEMBL_334702 (CHEMBL862536)
IC50
8±n/a nM
Citation
 Cockcroft, XLDillon, KJDixon, LDrzewiecki, JKerrigan, FLoh, VMMartin, NMMenear, KASmith, GC Phthalazinones 2: Optimisation and synthesis of novel potent inhibitors of poly(ADP-ribose)polymerase. Bioorg Med Chem Lett 16:1040-4 (2006)  
Target
Name:
Poly [ADP-ribose] polymerase 1
Synonyms:
(ARTD1 or PARP1) 2.4.2.30 ADPRT ARTD1 Human diphtheria toxin-like ADP-ribosyltransferase (ARTD1 or PARP1) NT-PARP-1 PARP1 PPOL Poly [ADP-ribose] polymerase 1 (PARP) Poly [ADP-ribose] polymerase 1 (PARP1) Poly [ADP-ribose] polymerase 1, 28-kDa form Poly [ADP-ribose] polymerase 1, processed C-terminus Poly [ADP-ribose] polymerase-1 Poly(ADP-ribose) polymerase-1 (ARTD1/PARP1) Protein poly-ADP-ribosyltransferase PARP1 | Synonyms=ADPRT
Type:
Mol. Mass.:
113114.22
Organism:
Homo sapiens (Human)
Description:
P09874
Residue:
1014
  
Inhibitor
Name:
BDBM50177460
Synonyms:
CHEMBL204862 | N-(4-methoxyphenyl)-4-(3-((4-oxo-3,4-dihydrophthalazin-1-yl)methyl)benzoyl)-1,4-diazepane-1-carboxamide
Type:
Small organic molecule
Emp. Form.:
C29H29N5O4
Mol. Mass.:
511.5717
SMILES:
COc1ccc(NC(=O)N2CCCN(CC2)C(=O)c2cccc(Cc3n[nH]c(=O)c4ccccc34)c2)cc1
: