Target
Delta-type opioid receptor
Ligand
BDBM50177701
Substrate
Meas. Tech.
ChEMBL_333515 (CHEMBL866454)
Ki
120±n/a nM
Citation
 Le Bourdonnec, BGoodman, AJMichaut, MYe, HFGraczyk, TMBelanger, SDeHaven, RNDolle, RE Synthesis and structure-activity relationships of a new series of 2alpha-substituted trans-4,5-dimethyl-4-(3-hydroxyphenyl)piperidine as mu-selective opioid antagonists. Bioorg Med Chem Lett 16:864-8 (2006)  
Target
Name:
Delta-type opioid receptor
Synonyms:
D-OR-1 Delta opioid receptor OPIATE Delta OPRD1 OPRK1 | opioid receptor, delta 1
Type:
G Protein-Coupled Receptor (GPCR)
Mol. Mass.:
40382.98
Organism:
Homo sapiens (Human)
Description:
Competition binding assays were carried out using membrane preparations from transfected HN9.10 cells that constitutively expressed the delta opioid receptor.
Residue:
372
  
Inhibitor
Name:
BDBM50177701
Synonyms:
3-(trans-4,5-dimethyl-1-phenethyl-2-alpha-propylpiperidin-4-yl)phenol | CHEMBL382919
Type:
Small organic molecule
Emp. Form.:
C24H33NO
Mol. Mass.:
351.5249
SMILES:
CCC[C@@H]1C[C@](C)([C@@H](C)CN1CCc1ccccc1)c1cccc(O)c1
: