Target
Cathepsin K
Ligand
BDBM50410598
Substrate
Meas. Tech.
ChEMBL_325792 (CHEMBL862698)
Ki
350±n/a nM
Citation
 Palmer, JTBryant, CWang, DXDavis, DESetti, ELRydzewski, RMVenkatraman, STian, ZQBurrill, LCMendonca, RVSpringman, EMcCarter, JChung, TCheung, HJanc, JWMcGrath, MSomoza, JREnriquez, PYu, ZWStrickley, RMLiu, LVenuti, MCPercival, MDFalgueyret, JPPrasit, POballa, RRiendeau, DYoung, RNWesolowski, GRodan, SBJohnson, CKimmel, DBRodan, G Design and synthesis of tri-ring P3 benzamide-containing aminonitriles as potent, selective, orally effective inhibitors of cathepsin K. J Med Chem 48:7520-34 (2005)  
Target
Name:
Cathepsin K
Synonyms:
CATK_RABIT | CTSK
Type:
Enzyme
Mol. Mass.:
36879.51
Organism:
Oryctolagus cuniculus (rabbit)
Description:
Residue:
329
  
Inhibitor
Name:
BDBM50410598
Synonyms:
CHEMBL372977
Type:
Small organic molecule
Emp. Form.:
C16H18F3N3O3
Mol. Mass.:
357.3276
SMILES:
CC(C[C@H](NC(=O)OCc1ccccc1)C(=O)NCC#N)C(F)(F)F
: