Target
Cathepsin K
Ligand
BDBM50410599
Substrate
Meas. Tech.
ChEMBL_325792 (CHEMBL862698)
Ki
>150000±n/a nM
Citation
 Palmer, JTBryant, CWang, DXDavis, DESetti, ELRydzewski, RMVenkatraman, STian, ZQBurrill, LCMendonca, RVSpringman, EMcCarter, JChung, TCheung, HJanc, JWMcGrath, MSomoza, JREnriquez, PYu, ZWStrickley, RMLiu, LVenuti, MCPercival, MDFalgueyret, JPPrasit, POballa, RRiendeau, DYoung, RNWesolowski, GRodan, SBJohnson, CKimmel, DBRodan, G Design and synthesis of tri-ring P3 benzamide-containing aminonitriles as potent, selective, orally effective inhibitors of cathepsin K. J Med Chem 48:7520-34 (2005)  
Target
Name:
Cathepsin K
Synonyms:
CATK_RABIT | CTSK
Type:
Enzyme
Mol. Mass.:
36879.51
Organism:
Oryctolagus cuniculus (rabbit)
Description:
Residue:
329
  
Inhibitor
Name:
BDBM50410599
Synonyms:
CHEMBL200776
Type:
Small organic molecule
Emp. Form.:
C14H15N3O3
Mol. Mass.:
273.2872
SMILES:
O=C(NC1(CC1)C(=O)NCC#N)OCc1ccccc1
: