Target
Gamma-aminobutyric acid receptor subunit alpha-2/beta-2/gamma-2
Ligand
BDBM50083899
Substrate
Meas. Tech.
ChEMBL_2232269 (CHEMBL5146041)
Ki
233±n/a nM
Citation
 Golani, LKYeunus Mian, MAhmed, TPandey, KPMondal, PSharmin, DRezvanian, SWitkin, JMCook, JM Rationalizing the binding and ? subtype selectivity of synthesized imidazodiazepines and benzodiazepines at GABAA receptors by using molecular docking studies. Bioorg Med Chem Lett 62:0 (2022) Target
Name:
Gamma-aminobutyric acid receptor subunit alpha-2/beta-2/gamma-2
Synonyms:
GABA A receptor alpha-2/beta-2/gamma-2 | GABA receptor alpha-2/beta-2/gamma-2 subunit
Type:
Mol. Mass.:
Description:
ASSAY_ID of EBI is 69647
Components:
This complex has 3 components.
Component 1
Name:
Gamma-aminobutyric acid receptor subunit gamma-2
Synonyms:
GABA(A) receptor subunit gamma-2 GBRG2_HUMAN
Type:
PROTEIN
Mol. Mass.:
54172.74
Organism:
Homo sapiens (Human)
Description:
EBI_217
Residue:
467
  
Component 2
Name:
Gamma-aminobutyric acid receptor subunit beta-2
Synonyms:
GABA(A) receptor subunit beta-2 GBRB2_HUMAN
Type:
PROTEIN
Mol. Mass.:
59167.91
Organism:
Homo sapiens (Human)
Description:
EBI_221
Residue:
512
  
Component 3
Name:
Gamma-aminobutyric acid receptor subunit alpha-2
Synonyms:
GABA receptor alpha-2 subunit GBRA2_HUMAN | Gamma-aminobutyric acid receptor subunit alpha-2 (GABRA2)
Type:
Protein
Mol. Mass.:
51338.78
Organism:
Homo sapiens (Human)
Description:
P47869
Residue:
451
  
Component 4
Name:
Gamma-aminobutyric acid receptor subunit beta-2
Synonyms:
GABA(A) receptor subunit beta-2 GBRB2_HUMAN
Type:
PROTEIN
Mol. Mass.:
59167.91
Organism:
Homo sapiens (Human)
Description:
EBI_221
Residue:
512
  
Inhibitor
Name:
BDBM50083899
Synonyms:
5-Phenyl-1,3-dihydro-benzo[e][1,4]diazepin-2-one Ro-05-2921
Type:
Small organic molecule
Emp. Form.:
C15H12N2O
Mol. Mass.:
236.2686
SMILES:
O=C1CN=C(c2ccccc2)c2ccccc2N1
: