Target
Gamma-aminobutyric acid receptor subunit alpha-5/beta-2/gamma-2
Ligand
BDBM50599947
Substrate
Meas. Tech.
ChEMBL_2232271 (CHEMBL5146043)
Ki
0.800000±n/a nM
Citation
 Golani, LKYeunus Mian, MAhmed, TPandey, KPMondal, PSharmin, DRezvanian, SWitkin, JMCook, JM Rationalizing the binding and ? subtype selectivity of synthesized imidazodiazepines and benzodiazepines at GABAA receptors by using molecular docking studies. Bioorg Med Chem Lett 62:0 (2022) Target
Name:
Gamma-aminobutyric acid receptor subunit alpha-5/beta-2/gamma-2
Synonyms:
Type:
Mol. Mass.:
Description:
ASSAY_ID of ChEMBL is 2186858
Components:
This complex has 3 components.
Component 1
Name:
Gamma-aminobutyric acid receptor subunit beta-2
Synonyms:
GABA(A) receptor subunit beta-2 GBRB2_HUMAN
Type:
PROTEIN
Mol. Mass.:
59167.91
Organism:
Homo sapiens (Human)
Description:
EBI_221
Residue:
512
  
Component 2
Name:
Gamma-aminobutyric acid receptor subunit gamma-2
Synonyms:
GABA(A) receptor subunit gamma-2 GBRG2_HUMAN
Type:
PROTEIN
Mol. Mass.:
54172.74
Organism:
Homo sapiens (Human)
Description:
EBI_217
Residue:
467
  
Component 3
Name:
Gamma-aminobutyric acid receptor subunit alpha-5
Synonyms:
GABA receptor alpha-5 subunit GABRA5 Gamma-aminobutyric acid receptor subunit alpha-5 (GABA(A)) | Gamma-aminobutyric acid receptor subunit alpha-5 (GABAA)
Type:
Enzyme
Mol. Mass.:
52160.59
Organism:
Homo sapiens (Human)
Description:
P31644
Residue:
462
  
Inhibitor
Name:
BDBM50599947
Synonyms:
CHEMBL5192472
Type:
Small organic molecule
Emp. Form.:
C18H13FN2O
Mol. Mass.:
292.307
SMILES:
CN1c2ccc(cc2C(=NCC1=O)c1ccccc1F)C#C
: