Target
Dynamin-1
Ligand
BDBM5153
Substrate
Meas. Tech.
ChEMBL_326472 (CHEMBL864467)
IC50
5000±n/a nM
Citation
 Hill, TOdell, LREdwards, JKGraham, MEMcGeachie, ABRusak, JQuan, AAbagyan, RScott, JLRobinson, PJMcCluskey, A Small molecule inhibitors of dynamin I GTPase activity: development of dimeric tyrphostins. J Med Chem 48:7781-8 (2005)  
Target
Name:
Dynamin-1
Synonyms:
DNM DYN1_HUMAN | Dynamin-1
Type:
PROTEIN
Mol. Mass.:
97411.67
Organism:
Homo sapiens (Human)
Description:
ChEMBL_1458576
Residue:
864
  
Inhibitor
Name:
BDBM5153
Synonyms:
(2E)-2-cyano-N-{5-[(2E)-2-cyano-3-(3,4-dihydroxyphenyl)prop-2-enamido]pentyl}-3-(3,4-dihydroxyphenyl)prop-2-enamide Dimeric Tyrphostin 6
Type:
Small organic molecule
Emp. Form.:
C25H24N4O6
Mol. Mass.:
476.4813
SMILES:
Oc1ccc(\C=C(/C#N)C(=O)NCCCCCNC(=O)C(=C\c2ccc(O)c(O)c2)\C#N)cc1O
: