Target
Dynamin-1
Ligand
BDBM50177940
Substrate
Meas. Tech.
ChEMBL_326472 (CHEMBL864467)
IC50
5100±n/a nM
Citation
 Hill, TOdell, LREdwards, JKGraham, MEMcGeachie, ABRusak, JQuan, AAbagyan, RScott, JLRobinson, PJMcCluskey, A Small molecule inhibitors of dynamin I GTPase activity: development of dimeric tyrphostins. J Med Chem 48:7781-8 (2005)  
Target
Name:
Dynamin-1
Synonyms:
DNM DYN1_HUMAN | Dynamin-1
Type:
PROTEIN
Mol. Mass.:
97411.67
Organism:
Homo sapiens (Human)
Description:
ChEMBL_1458576
Residue:
864
  
Inhibitor
Name:
BDBM50177940
Synonyms:
2-cyano-N-{3-[2-cyano-3-(3,4-dihydroxyphenyl)acryloylamino]-2-hydroxypropyl}-3-(3,4-dihydroxyphenyl)acrylamide | CHEMBL198705
Type:
Small organic molecule
Emp. Form.:
C23H20N4O7
Mol. Mass.:
464.4275
SMILES:
OC(CNC(=O)C(=C\c1ccc(O)c(O)c1)\C#N)CNC(=O)C(=C\c1ccc(O)c(O)c1)\C#N
: