Target
Cyclin-dependent kinase 5
Ligand
BDBM12621
Substrate
Meas. Tech.
ChEMBL_2232496 (CHEMBL5146268)
IC50
0.100000±n/a nM
Citation
 Xie, ZHou, SYang, XDuan, YHan, JWang, QLiao, C Lessons Learned from Past Cyclin-Dependent Kinase Drug Discovery Efforts. J Med Chem 65:6356-6389 (2022) Target
Name:
Cyclin-dependent kinase 5
Synonyms:
CDK5 CDKN5 Cyclin-dependent kinase 5 (CDK5/ p25) Cyclin-dependent-like kinase 5 PSSALRE Tau protein kinase II catalytic subunit
Type:
Enzyme Subunit
Mol. Mass.:
33308.61
Organism:
Homo sapiens (Human)
Description:
Residue:
292
  
Inhibitor
Name:
BDBM12621
Synonyms:
2,4-Diamino-5-ketopyrimidine 39 R547 | [4-Amino-2-(1-methanesulfonylpiperidin-4-ylamino)pyrimidin-5-yl](2,3-difluoro-6-methoxyphenyl)methanone
Type:
Small organic molecule
Emp. Form.:
C18H21F2N5O4S
Mol. Mass.:
441.452
SMILES:
COc1ccc(F)c(F)c1C(=O)c1cnc(NC2CCN(CC2)S(C)(=O)=O)nc1N
: