Target
Sodium-dependent noradrenaline transporter
Ligand
BDBM50178369
Substrate
Meas. Tech.
ChEMBL_339940 (CHEMBL862356)
IC50
3200±n/a nM
Citation
 Middleton, DSAndrews, MGlossop, PGymer, GJessiman, AJohnson, PSMackenny, MPitcher, MJRooker, TStobie, ATang, KMorgan, P Designing rapid onset selective serotonin re-uptake inhibitors. Part 1: Structure-activity relationships of substituted (1S,4S)-4-(3,4-dichlorophenyl)-N-methyl-1,2,3,4-tetrahydro-1-naphthaleneamine. Bioorg Med Chem Lett 16:1434-9 (2006)  
Target
Name:
Sodium-dependent noradrenaline transporter
Synonyms:
Monoamine transporter NET Noradrenaline Transporter (NET) Norepinephrine transporter protein (NET) SLC6A2 Sodium-dependent noradrenaline transporter (NET) | Solute carrier family 6 member 2
Type:
Multi-pass membrane protein
Mol. Mass.:
69337.72
Organism:
Homo sapiens (Human)
Description:
P23975
Residue:
617
  
Inhibitor
Name:
BDBM50178369
Synonyms:
(5S,8S)-5-(3,4-dichlorophenyl)-8-(methylamino)-5,6,7,8-tetrahydronaphthalene-2-carbonitrile | CHEMBL203741
Type:
Small organic molecule
Emp. Form.:
C18H16Cl2N2
Mol. Mass.:
331.239
SMILES:
CN[C@H]1CC[C@@H](c2ccc(Cl)c(Cl)c2)c2ccc(cc12)C#N
: