Target
Sodium- and chloride-dependent glycine transporter 1
Ligand
BDBM50178417
Substrate
Meas. Tech.
ChEMBL_339708 (CHEMBL867170)
IC50
28±n/a nM
Citation
 Thomson, CGDuncan, KFletcher, SRHuscroft, ITPillai, GRaubo, PSmith, AJStead, D Sarcosine based indandione hGlyT1 inhibitors. Bioorg Med Chem Lett 16:1388-91 (2006)  
Target
Name:
Sodium- and chloride-dependent glycine transporter 1
Synonyms:
GlyT-1 Glycine Transporters (GlyT1c) SC6A9_HUMAN Sodium- and chloride-dependent glycine transporter 1 Sodium- and chloride-dependent glycine transporter 1 (GlyT1c) Solute carrier family 6 member 9
Type:
Enzyme
Mol. Mass.:
78270.54
Organism:
Homo sapiens (Human)
Description:
P48067
Residue:
706
  
Inhibitor
Name:
BDBM50178417
Synonyms:
2-((2-(5-chloro-1,3-dioxo-2-phenyl-2,3-dihydro-1H-inden-2-yl)ethyl)(methyl)amino)acetic acid | CHEMBL203298
Type:
Small organic molecule
Emp. Form.:
C20H18ClNO4
Mol. Mass.:
371.814
SMILES:
CN(CCC1(C(=O)c2ccc(Cl)cc2C1=O)c1ccccc1)CC(O)=O
: