Target
Bromodomain-containing protein 4
Ligand
BDBM50399434
Substrate
Meas. Tech.
ChEMBL_2233252 (CHEMBL5147024)
IC50
41±n/a nM
Citation
 Yatchang, MFMathew, BSrivastava, RKKhan, JMuzaffar, SZhang, SWu, MZhai, LRuiz, PAgarwal, ABostwick, JRSuto, MJAthar, MAugelli-Szafran, CE Development of BRD4 inhibitors as anti-inflammatory agents and antidotes for arsenicals. Bioorg Med Chem Lett 64:0 (2022) Target
Name:
Bromodomain-containing protein 4
Synonyms:
BRD4 Bromodomain-containing protein 4 (BRD4) Protein HUNK1
Type:
Protein
Mol. Mass.:
152264.84
Organism:
Homo sapiens (Human)
Description:
O60885
Residue:
1362
  
Inhibitor
Name:
BDBM50399434
Synonyms:
CHEMBL2179387
Type:
Small organic molecule
Emp. Form.:
C16H17N3O4S
Mol. Mass.:
347.389
SMILES:
COc1ccccc1S(=O)(=O)Nc1ccc2NC(=O)N(C)Cc2c1
: