Target
DNA topoisomerase 4 subunit A
Ligand
BDBM50178885
Substrate
Meas. Tech.
ChEMBL_338453 (CHEMBL865343)
IC50
33000±n/a nM
Citation
 Wiles, JASong, YWang, QLucien, EHashimoto, ACheng, JMarlor, CWOu, YPodos, SDThanassi, JAThoma, CLDeshpande, MPucci, MJBradbury, BJ Biological evaluation of isothiazoloquinolones containing aromatic heterocycles at the 7-position: In vitro activity of a series of potent antibacterial agents that are effective against methicillin-resistant Staphylococcus aureus. Bioorg Med Chem Lett 16:1277-81 (2006)  
Target
Name:
DNA topoisomerase 4 subunit A
Synonyms:
PARC_STAAU grlA | parC
Type:
PROTEIN
Mol. Mass.:
91040.14
Organism:
Staphylococcus aureus
Description:
ChEMBL_340188
Residue:
800
  
Inhibitor
Name:
BDBM50178885
Synonyms:
9-cyclopropyl-6-fluoro-7-(quinolin-5-yl)isothiazolo[5,4-b]quinoline-3,4(2H,9H)-dione | CHEMBL425233
Type:
Small organic molecule
Emp. Form.:
C22H14FN3O2S
Mol. Mass.:
403.429
SMILES:
Fc1cc2c(cc1-c1cccc3ncccc13)n(C1CC1)c1s[nH]c(=O)c1c2=O
: