Target
DNA topoisomerase 4 subunit A
Ligand
BDBM50178890
Substrate
Meas. Tech.
ChEMBL_338453 (CHEMBL865343)
IC50
18000±n/a nM
Citation
 Wiles, JASong, YWang, QLucien, EHashimoto, ACheng, JMarlor, CWOu, YPodos, SDThanassi, JAThoma, CLDeshpande, MPucci, MJBradbury, BJ Biological evaluation of isothiazoloquinolones containing aromatic heterocycles at the 7-position: In vitro activity of a series of potent antibacterial agents that are effective against methicillin-resistant Staphylococcus aureus. Bioorg Med Chem Lett 16:1277-81 (2006)  
Target
Name:
DNA topoisomerase 4 subunit A
Synonyms:
PARC_STAAU grlA | parC
Type:
PROTEIN
Mol. Mass.:
91040.14
Organism:
Staphylococcus aureus
Description:
ChEMBL_340188
Residue:
800
  
Inhibitor
Name:
BDBM50178890
Synonyms:
7-(6-(1H-pyrrol-1-yl)pyridin-3-yl)-9-cyclopropyl-6-fluoroisothiazolo[5,4-b]quinoline-3,4(2H,9H)-dione | CHEMBL204899
Type:
Small organic molecule
Emp. Form.:
C22H15FN4O2S
Mol. Mass.:
418.444
SMILES:
Fc1cc2c(cc1-c1ccc(nc1)-n1cccc1)n(C1CC1)c1s[nH]c(=O)c1c2=O
: