Target
Putative sugar transporter
Ligand
BDBM50179094
Substrate
Meas. Tech.
ChEMBL_338364 (CHEMBL866544)
Ki
32000±n/a nM
Citation
 Fayolle, MIonita, MKrishna, SMorin, CPatel, AP Probing structure/affinity relationships for the Plasmodium falciparum hexose transporter with glucose derivatives. Bioorg Med Chem Lett 16:1267-71 (2006)  
Target
Name:
Putative sugar transporter
Synonyms:
Hexose transporter 1
Type:
PROTEIN
Mol. Mass.:
56427.07
Organism:
Plasmodium falciparum
Description:
ChEMBL_456666
Residue:
504
  
Inhibitor
Name:
BDBM50179094
Synonyms:
(3R,4S,5R,6R)-6-(hydroxymethyl)-4-(nonyloxy)-tetrahydro-2H-pyran-2,3,5-triol | CHEMBL204504
Type:
Small organic molecule
Emp. Form.:
C15H30O6
Mol. Mass.:
306.3951
SMILES:
CCCCCCCCCO[C@@H]1[C@@H](O)C(O)O[C@H](CO)[C@H]1O
: