Target
Retinoic acid receptor RXR-beta
Ligand
BDBM50179113
Substrate
Meas. Tech.
ChEMBL_349699 (CHEMBL866290)
Ki
60±n/a nM
Citation
 Farmer, LJMarron, KSCanan Koch, SSHwang, CKKallel, EAZhi, LNadzan, AMRobertson, DWBennani, YL Aza-retinoids as novel retinoid X receptor-specific agonists. Bioorg Med Chem Lett 16:2352-6 (2006)  
Target
Name:
Retinoic acid receptor RXR-beta
Synonyms:
NR2B2 RXRB Retinoic acid receptor RXR-beta Retinoid receptor
Type:
PROTEIN
Mol. Mass.:
56932.89
Organism:
Homo sapiens (Human)
Description:
ChEMBL_39045
Residue:
533
  
Inhibitor
Name:
BDBM50179113
Synonyms:
(2E,4E)-6-(butyl(6-tert-butyl-1,1-dimethyl-2,3-dihydro-1H-inden-4-yl)amino)-3-methylhexa-2,4-dienoic acid | CHEMBL204725
Type:
Small organic molecule
Emp. Form.:
C26H39NO2
Mol. Mass.:
397.5934
SMILES:
CCCCN(C\C=C\C(\C)=C\C(O)=O)c1cc(cc2c1CCC2(C)C)C(C)(C)C
: