Target
Retinoic acid receptor RXR-beta
Ligand
BDBM50179119
Substrate
Meas. Tech.
ChEMBL_349699 (CHEMBL866290)
Ki
24±n/a nM
Citation
 Farmer, LJMarron, KSCanan Koch, SSHwang, CKKallel, EAZhi, LNadzan, AMRobertson, DWBennani, YL Aza-retinoids as novel retinoid X receptor-specific agonists. Bioorg Med Chem Lett 16:2352-6 (2006)  
Target
Name:
Retinoic acid receptor RXR-beta
Synonyms:
NR2B2 RXRB Retinoic acid receptor RXR-beta Retinoid receptor
Type:
PROTEIN
Mol. Mass.:
56932.89
Organism:
Homo sapiens (Human)
Description:
ChEMBL_39045
Residue:
533
  
Inhibitor
Name:
BDBM50179119
Synonyms:
(2E,4E)-6-((3,5-di-tert-butylphenyl)(ethyl)amino)-3-methylhexa-2,4-dienoic acid | CHEMBL205634
Type:
Small organic molecule
Emp. Form.:
C23H35NO2
Mol. Mass.:
357.5295
SMILES:
CCN(C\C=C\C(\C)=C\C(O)=O)c1cc(cc(c1)C(C)(C)C)C(C)(C)C
: