Target
Retinoic acid receptor RXR-gamma
Ligand
BDBM50179131
Substrate
Meas. Tech.
ChEMBL_349701 (CHEMBL865142)
Ki
99±n/a nM
Citation
 Farmer, LJMarron, KSCanan Koch, SSHwang, CKKallel, EAZhi, LNadzan, AMRobertson, DWBennani, YL Aza-retinoids as novel retinoid X receptor-specific agonists. Bioorg Med Chem Lett 16:2352-6 (2006)  
Target
Name:
Retinoic acid receptor RXR-gamma
Synonyms:
NR2B3 RXRG Retinoic acid receptor RXR-gamma Retinoid X receptor gamma/retinoic acid receptor alpha
Type:
PROTEIN
Mol. Mass.:
50878.26
Organism:
Homo sapiens (Human)
Description:
ChEMBL_197216
Residue:
463
  
Inhibitor
Name:
BDBM50179131
Synonyms:
(2E,4E)-6-(ethyl(3,5,5,8,8-pentamethyl-5,6,7,8-tetrahydronaphthalen-2-yl)amino)-3-methylhexa-2,4-dienoic acid | CHEMBL427391
Type:
Small organic molecule
Emp. Form.:
C24H35NO2
Mol. Mass.:
369.5402
SMILES:
CCN(C\C=C\C(\C)=C\C(O)=O)c1cc2c(cc1C)C(C)(C)CCC2(C)C
: