Target
Histamine H4 receptor
Ligand
BDBM50179337
Substrate
Meas. Tech.
ChEMBL_325600 (CHEMBL860282)
Ki
49±n/a nM
Citation
 Venable, JDCai, HChai, WDvorak, CAGrice, CAJablonowski, JAShah, CRKwok, AKLy, KSPio, BWei, JDesai, PJJiang, WNguyen, SLing, PWilson, SJDunford, PJThurmond, RLLovenberg, TWKarlsson, LCarruthers, NIEdwards, JP Preparation and biological evaluation of indole, benzimidazole, and thienopyrrole piperazine carboxamides: potent human histamine h(4) antagonists. J Med Chem 48:8289-98 (2005)  
Target
Name:
Histamine H4 receptor
Synonyms:
AXOR35 GPCR105 HH4R HRH4 Histamine H4 receptor Histamine receptor (H3 and H4) SP9144
Type:
G Protein-Coupled Receptor (GPCR)
Mol. Mass.:
44517.02
Organism:
Homo sapiens (Human)
Description:
Binding assays were using CHO cells stably expressing hH4R receptors.
Residue:
390
  
Inhibitor
Name:
BDBM50179337
Synonyms:
(4,5-difluoro-1H-benzoimidazol-2-yl)(4-methylpiperazin-1-yl)methanone | CHEMBL338972
Type:
Small organic molecule
Emp. Form.:
C13H14F2N4O
Mol. Mass.:
280.2733
SMILES:
CN1CCN(CC1)C(=O)c1nc2ccc(F)c(F)c2[nH]1
: