Target
Histamine H4 receptor
Ligand
BDBM50179344
Substrate
Meas. Tech.
ChEMBL_325600 (CHEMBL860282)
Ki
40±n/a nM
Citation
 Venable, JDCai, HChai, WDvorak, CAGrice, CAJablonowski, JAShah, CRKwok, AKLy, KSPio, BWei, JDesai, PJJiang, WNguyen, SLing, PWilson, SJDunford, PJThurmond, RLLovenberg, TWKarlsson, LCarruthers, NIEdwards, JP Preparation and biological evaluation of indole, benzimidazole, and thienopyrrole piperazine carboxamides: potent human histamine h(4) antagonists. J Med Chem 48:8289-98 (2005)  
Target
Name:
Histamine H4 receptor
Synonyms:
AXOR35 GPCR105 HH4R HRH4 Histamine H4 receptor Histamine receptor (H3 and H4) SP9144
Type:
G Protein-Coupled Receptor (GPCR)
Mol. Mass.:
44517.02
Organism:
Homo sapiens (Human)
Description:
Binding assays were using CHO cells stably expressing hH4R receptors.
Residue:
390
  
Inhibitor
Name:
BDBM50179344
Synonyms:
(2-chloro-4H-thieno[3,2-b]pyrrol-5-yl)(4-methylpiperazin-1-yl)methanone | CHEMBL370135
Type:
Small organic molecule
Emp. Form.:
C12H14ClN3OS
Mol. Mass.:
283.777
SMILES:
CN1CCN(CC1)C(=O)c1cc2sc(Cl)cc2[nH]1
: