Target
Histamine H4 receptor
Ligand
BDBM50132996
Substrate
Meas. Tech.
ChEMBL_325600 (CHEMBL860282)
Ki
15±n/a nM
Citation
 Venable, JDCai, HChai, WDvorak, CAGrice, CAJablonowski, JAShah, CRKwok, AKLy, KSPio, BWei, JDesai, PJJiang, WNguyen, SLing, PWilson, SJDunford, PJThurmond, RLLovenberg, TWKarlsson, LCarruthers, NIEdwards, JP Preparation and biological evaluation of indole, benzimidazole, and thienopyrrole piperazine carboxamides: potent human histamine h(4) antagonists. J Med Chem 48:8289-98 (2005)  
Target
Name:
Histamine H4 receptor
Synonyms:
AXOR35 GPCR105 HH4R HRH4 Histamine H4 receptor Histamine receptor (H3 and H4) SP9144
Type:
G Protein-Coupled Receptor (GPCR)
Mol. Mass.:
44517.02
Organism:
Homo sapiens (Human)
Description:
Binding assays were using CHO cells stably expressing hH4R receptors.
Residue:
390
  
Inhibitor
Name:
BDBM50132996
Synonyms:
(5-Fluoro-1H-indol-2-yl)-(4-methyl-piperazin-1-yl)-methanone CHEMBL436381
Type:
Small organic molecule
Emp. Form.:
C14H16FN3O
Mol. Mass.:
261.2947
SMILES:
CN1CCN(CC1)C(=O)c1cc2cc(F)ccc2[nH]1
: