Target
Adenosine receptor A2a
Ligand
BDBM50600757
Substrate
Meas. Tech.
ChEMBL_2234772 (CHEMBL5148544)
EC50
1.4±n/a nM
Citation
 Liu, SDing, WHuang, WZhang, ZGuo, YZhang, QWu, LLi, YQin, RLi, JShi, TZhang, XLei, JHu, W Discovery of Novel Benzo[4,5]imidazo[1,2- J Med Chem 65:8933-8947 (2022) Target
Name:
Adenosine receptor A2a
Synonyms:
A2A adenosine receptor (hA2A) ADENOSINE A2 ADORA2 Adenosine A2A receptor (A2AAR)
Type:
G Protein-Coupled Receptor (GPCR)
Mol. Mass.:
44716.46
Organism:
Homo sapiens (Human)
Description:
P29274
Residue:
412
  
Inhibitor
Name:
BDBM50600757
Synonyms:
CHEMBL5208415
Type:
Small organic molecule
Emp. Form.:
C17H14N6O
Mol. Mass.:
318.3327
SMILES:
Nc1nc(cn2c1nc1ccccc21)C(=O)NCc1cccnc1
: