Target
Metabotropic glutamate receptor 5
Ligand
BDBM50181063
Substrate
Meas. Tech.
ChEMBL_345726 (CHEMBL860880)
Ki
>3000±n/a nM
Citation
 Büttelmann, BPeters, JUCeccarelli, SKolczewski, SVieira, EPrinssen, EPSpooren, WSchuler, FHuwyler, JPorter, RHJaeschke, G Arylmethoxypyridines as novel, potent and orally active mGlu5 receptor antagonists. Bioorg Med Chem Lett 16:1892-7 (2006)  
Target
Name:
Metabotropic glutamate receptor 5
Synonyms:
GPRC1E GRM5_HUMAN metabotropic glutamate 5 | metabotropic glutamate 5a
Type:
Enzyme
Mol. Mass.:
132484.72
Organism:
Homo sapiens (Human)
Description:
Residue:
1212
  
Inhibitor
Name:
BDBM50181063
Synonyms:
4-(3-chlorobenzyloxy)-2-(2,5-dimethyl-1H-pyrrol-1-yl)-6-methylpyridine | CHEMBL205160
Type:
Small organic molecule
Emp. Form.:
C19H19ClN2O
Mol. Mass.:
326.82
SMILES:
Cc1ccc(C)n1-c1cc(OCc2cccc(Cl)c2)cc(C)n1
: