Target
Squalene monooxygenase
Ligand
BDBM18957
Substrate
Meas. Tech.
ChEMBL_331288 (CHEMBL869978)
IC50
12000±n/a nM
Citation
 Benaim, GSanders, JMGarcia-Marchán, YColina, CLira, RCaldera, ARPayares, GSanoja, CBurgos, JMLeon-Rossell, AConcepcion, JLSchijman, AGLevin, MOldfield, EUrbina, JA Amiodarone has intrinsic anti-Trypanosoma cruzi activity and acts synergistically with posaconazole. J Med Chem 49:892-9 (2006)  
Target
Name:
Squalene monooxygenase
Synonyms:
ERG1 SE Squalene epoxidase
Type:
PROTEIN
Mol. Mass.:
63936.94
Organism:
Homo sapiens (Human)
Description:
ChEMBL_201924
Residue:
574
  
Inhibitor
Name:
BDBM18957
Synonyms:
(2-{4-[(2-butyl-1-benzofuran-3-yl)carbonyl]-2,6-diiodophenoxy}ethyl)diethylamine Amiodarone Cordarone cid_441325
Type:
Small organic molecule
Emp. Form.:
C25H29I2NO3
Mol. Mass.:
645.3116
SMILES:
CCCCc1oc2ccccc2c1C(=O)c1cc(I)c(OCCN(CC)CC)c(I)c1
: