Target
Peptidyl-prolyl cis-trans isomerase A
Ligand
BDBM50181478
Substrate
Meas. Tech.
ChEMBL_330335 (CHEMBL869970)
IC50
592±n/a nM
Citation
 Guichou, JFViaud, JMettling, CSubra, GLin, YLChavanieu, A Structure-based design, synthesis, and biological evaluation of novel inhibitors of human cyclophilin A. J Med Chem 49:900-10 (2006)  
Target
Name:
Peptidyl-prolyl cis-trans isomerase A
Synonyms:
CYPA Cyclophilin A PPIA PPIase A Rotamase A
Type:
Protein
Mol. Mass.:
18015.32
Organism:
Homo sapiens (Human)
Description:
P62937
Residue:
165
  
Inhibitor
Name:
BDBM50181478
Synonyms:
1-(3-benzyloxy-pyridin-2-yl)-3-(2-chloro-phenyl)-urea | CHEMBL201450
Type:
Small organic molecule
Emp. Form.:
C19H16ClN3O2
Mol. Mass.:
353.802
SMILES:
Clc1ccccc1NC(=O)Nc1ncccc1OCc1ccccc1
: