Target
Peptidyl-prolyl cis-trans isomerase A
Ligand
BDBM50181479
Substrate
Meas. Tech.
ChEMBL_330335 (CHEMBL869970)
IC50
361±n/a nM
Citation
 Guichou, JFViaud, JMettling, CSubra, GLin, YLChavanieu, A Structure-based design, synthesis, and biological evaluation of novel inhibitors of human cyclophilin A. J Med Chem 49:900-10 (2006)  
Target
Name:
Peptidyl-prolyl cis-trans isomerase A
Synonyms:
CYPA Cyclophilin A PPIA PPIase A Rotamase A
Type:
Protein
Mol. Mass.:
18015.32
Organism:
Homo sapiens (Human)
Description:
P62937
Residue:
165
  
Inhibitor
Name:
BDBM50181479
Synonyms:
3-[3-(3-benzyloxy-pyridin-2-yl)-ureido]-benzamide | CHEMBL201394
Type:
Small organic molecule
Emp. Form.:
C20H18N4O3
Mol. Mass.:
362.3819
SMILES:
NC(=O)c1cccc(NC(=O)Nc2ncccc2OCc2ccccc2)c1
: