Target
Peptidyl-prolyl cis-trans isomerase A
Ligand
BDBM50181480
Substrate
Meas. Tech.
ChEMBL_330335 (CHEMBL869970)
IC50
640±n/a nM
Citation
 Guichou, JFViaud, JMettling, CSubra, GLin, YLChavanieu, A Structure-based design, synthesis, and biological evaluation of novel inhibitors of human cyclophilin A. J Med Chem 49:900-10 (2006)  
Target
Name:
Peptidyl-prolyl cis-trans isomerase A
Synonyms:
CYPA Cyclophilin A PPIA PPIase A Rotamase A
Type:
Protein
Mol. Mass.:
18015.32
Organism:
Homo sapiens (Human)
Description:
P62937
Residue:
165
  
Inhibitor
Name:
BDBM50181480
Synonyms:
1-(3-benzyloxy-pyridin-2-yl)-3-(4-chloro-phenyl)-urea | CHEMBL200133
Type:
Small organic molecule
Emp. Form.:
C19H16ClN3O2
Mol. Mass.:
353.802
SMILES:
Clc1ccc(NC(=O)Nc2ncccc2OCc2ccccc2)cc1
: