Target
Peptidyl-prolyl cis-trans isomerase A
Ligand
BDBM50181484
Substrate
Meas. Tech.
ChEMBL_330335 (CHEMBL869970)
IC50
951±n/a nM
Citation
 Guichou, JFViaud, JMettling, CSubra, GLin, YLChavanieu, A Structure-based design, synthesis, and biological evaluation of novel inhibitors of human cyclophilin A. J Med Chem 49:900-10 (2006)  
Target
Name:
Peptidyl-prolyl cis-trans isomerase A
Synonyms:
CYPA Cyclophilin A PPIA PPIase A Rotamase A
Type:
Protein
Mol. Mass.:
18015.32
Organism:
Homo sapiens (Human)
Description:
P62937
Residue:
165
  
Inhibitor
Name:
BDBM50181484
Synonyms:
3-[3-(3-benzyloxy-pyridin-2-yl)-ureido]-benzoic acid ethyl ester | CHEMBL201025
Type:
Small organic molecule
Emp. Form.:
C22H21N3O4
Mol. Mass.:
391.4198
SMILES:
CCOC(=O)c1cccc(NC(=O)Nc2ncccc2OCc2ccccc2)c1
: