Target
Peptidyl-prolyl cis-trans isomerase A
Ligand
BDBM50181494
Substrate
Meas. Tech.
ChEMBL_330335 (CHEMBL869970)
IC50
458±n/a nM
Citation
 Guichou, JFViaud, JMettling, CSubra, GLin, YLChavanieu, A Structure-based design, synthesis, and biological evaluation of novel inhibitors of human cyclophilin A. J Med Chem 49:900-10 (2006)  
Target
Name:
Peptidyl-prolyl cis-trans isomerase A
Synonyms:
CYPA Cyclophilin A PPIA PPIase A Rotamase A
Type:
Protein
Mol. Mass.:
18015.32
Organism:
Homo sapiens (Human)
Description:
P62937
Residue:
165
  
Inhibitor
Name:
BDBM50181494
Synonyms:
1-(3-benzyloxy-pyridin-2-yl)-3-(2,4-difluoro-phenyl)-urea | CHEMBL198293
Type:
Small organic molecule
Emp. Form.:
C19H15F2N3O2
Mol. Mass.:
355.3381
SMILES:
Fc1ccc(NC(=O)Nc2ncccc2OCc2ccccc2)c(F)c1
: