Target
Metabotropic glutamate receptor 5
Ligand
BDBM50084137
Substrate
Meas. Tech.
ChEMBL_331630 (CHEMBL864050)
IC50
39±n/a nM
Citation
 Iso, YGrajkowska, EWroblewski, JTDavis, JGoeders, NEJohnson, KMSanker, SRoth, BLTueckmantel, WKozikowski, AP Synthesis and structure-activity relationships of 3-[(2-methyl-1,3-thiazol-4-yl)ethynyl]pyridine analogues as potent, noncompetitive metabotropic glutamate receptor subtype 5 antagonists; search for cocaine medications. J Med Chem 49:1080-100 (2006)  
Target
Name:
Metabotropic glutamate receptor 5
Synonyms:
GPRC1E GRM5_HUMAN metabotropic glutamate 5 | metabotropic glutamate 5a
Type:
Enzyme
Mol. Mass.:
132484.72
Organism:
Homo sapiens (Human)
Description:
Residue:
1212
  
Inhibitor
Name:
BDBM50084137
Synonyms:
2-Methyl-6-(phenylethynyl)pyridine 2-Methyl-6-phenylethynyl-pyridine(MPEP) 2-methyl-6-(phenyl-ethynyl)pyridine 6-methyl-2-(2-phenylethynyl)pyridine CHEMBL66654 US10618900, No. MPEP | [3H]-2-methyl-6-(phenylethynyl)-pyridine
Type:
Small organic molecule
Emp. Form.:
C14H11N
Mol. Mass.:
193.2438
SMILES:
Cc1cccc(n1)C#Cc1ccccc1
: